﻿"Item Id","Item URI","Dublin Core:Title","Dublin Core:Subject","Dublin Core:Description","Dublin Core:Creator","Dublin Core:Source","Dublin Core:Publisher","Dublin Core:Date","Dublin Core:Contributor","Dublin Core:Rights","Dublin Core:Relation","Dublin Core:Format","Dublin Core:Language","Dublin Core:Type","Dublin Core:Identifier","Dublin Core:Coverage","Item Type Metadata:Text","Item Type Metadata:Interviewer","Item Type Metadata:Interviewee","Item Type Metadata:Location","Item Type Metadata:Transcription","Item Type Metadata:Local URL","Item Type Metadata:Original Format","Item Type Metadata:Physical Dimensions","Item Type Metadata:Duration","Item Type Metadata:Compression","Item Type Metadata:Producer","Item Type Metadata:Director","Item Type Metadata:Bit Rate/Frequency","Item Type Metadata:Time Summary","Item Type Metadata:Email Body","Item Type Metadata:Subject Line","Item Type Metadata:From","Item Type Metadata:To","Item Type Metadata:CC","Item Type Metadata:BCC","Item Type Metadata:Number of Attachments","Item Type Metadata:Standards","Item Type Metadata:Objectives","Item Type Metadata:Materials","Item Type Metadata:Lesson Plan Text","Item Type Metadata:URL","Item Type Metadata:Event Type","Item Type Metadata:Participants","Item Type Metadata:Birth Date","Item Type Metadata:Birthplace","Item Type Metadata:Death Date","Item Type Metadata:Occupation","Item Type Metadata:Biographical Text","Item Type Metadata:Bibliography","Item Type Metadata:Box","Item Type Metadata:Folder","Item Type Metadata:Series","Item Type Metadata:Screwworm Topical Chapter","Item Type Metadata:Screwworm Chrono Chapter","Item Type Metadata:Sub-collection","Item Type Metadata:Name","Item Type Metadata:Institution/Organization","PDF Text:Text",tags,file,itemType,collection,public,featured
7172,https://www.nal.usda.gov/exhibits/speccoll/items/show/7172,"Letter from Knipling to Stewart, 1958-September-16",Florida^^Texas,,Knipling,,,1958-09-16,"Stewart (recipient)",,,"Letter^^3 pages",,,screwworm_00209,,,,,,,,,,,,,,,,,,,,,,,,,,,,,,,,,,,,,,,,7,"Southeastern Eradication Records",,,,,"https://www.nal.usda.gov/exhibits/speccoll/files/original/bcef6b7c3c2d87fd1d9dc7418fab368a.jpg,https://www.nal.usda.gov/exhibits/speccoll/files/original/b8a148ed72aeb69478367d59f5e32116.jpg,https://www.nal.usda.gov/exhibits/speccoll/files/original/5bd4924f1444425484ea90cae0b5d288.jpg",Text,"Screwworm Eradication Records",1,0
7185,https://www.nal.usda.gov/exhibits/speccoll/items/show/7185,"Fly Release Breakdown Map","Mexico^^Texas^^fly release","Attachment, chart, Fly Release Breakdown, July 2, 1977 and Lanes Incomplete for Week Ending 7/2/77",,,,1977-07,,,,Map,,,screwworm_1349,,,,,,,,,,,,,,,,,,,,,,,,,,,,,,,,,,,,,,,,9,,,,,,https://www.nal.usda.gov/exhibits/speccoll/files/original/3987f63b7dd48712bf251856a84bb81d.jpg,Text,"Screwworm Eradication Records",1,0
7195,https://www.nal.usda.gov/exhibits/speccoll/items/show/7195,"Screw-Worm Research and Eradication:  New Developments","Texas^^Florida^^fly migration^^fly production",,Bushland,,,1958-07-22,,,,"Report^^8 pages",,,screwworm_00210,,,,,,,,,,,,,,,,,,,,,,,,,,,,,,,,,,,,,,,,6,"Southeastern Eradication Records",,,,,"https://www.nal.usda.gov/exhibits/speccoll/files/original/5442917d80154786eb1782bfdf2fcd3f.jpg,https://www.nal.usda.gov/exhibits/speccoll/files/original/7f27120f0317387ad1ce4d51f04bc9e4.jpg,https://www.nal.usda.gov/exhibits/speccoll/files/original/5de92bd44a47aa2572bf6fa280c29b0e.jpg,https://www.nal.usda.gov/exhibits/speccoll/files/original/10678d883e27fe492ffaa404308bbd68.jpg,https://www.nal.usda.gov/exhibits/speccoll/files/original/38e89f740b4840dec1ef21105dc528c7.jpg,https://www.nal.usda.gov/exhibits/speccoll/files/original/7c78ccd58c34f8d0863b519b93a9ff7e.jpg,https://www.nal.usda.gov/exhibits/speccoll/files/original/bf49524fd6041782badfea8870e3abb0.jpg,https://www.nal.usda.gov/exhibits/speccoll/files/original/4202d49c0116ea3701477d0cb3e87db4.jpg",Text,"Screwworm Eradication Records",1,0
7245,https://www.nal.usda.gov/exhibits/speccoll/items/show/7245,"Confirmed Screwworm Cases:  1962","case report^^Texas^^New Mexico^^Oklahoma",,,,,1962,,,,Map,,,screwworm_00245,,,,,,,,,,,,,,,,,,,,,,,,,,,,,,,,,,,,,,,13,9,"O.H. Graham Collection",,,,,https://www.nal.usda.gov/exhibits/speccoll/files/original/a4d051047ddf07a7a7bb3c5913f8772d.jpg,Text,"Screwworm Eradication Records",1,0
7247,https://www.nal.usda.gov/exhibits/speccoll/items/show/7247,"Confirmed Screwworm Cases:  1964","case report^^Texas^^New Mexico^^Arizona",,,,,1964,,,,Map,,,screwworm_00247,,,,,,,,,,,,,,,,,,,,,,,,,,,,,,,,,,,,,,,13,9,"O.H. Graham Collection",,,,,https://www.nal.usda.gov/exhibits/speccoll/files/original/af8c8527d1fe27154a74f2ceb82a7d17.jpg,Text,"Screwworm Eradication Records",1,0
7249,https://www.nal.usda.gov/exhibits/speccoll/items/show/7249,"Confirmed Screwworm Cases:  1967","case report^^Texas^^California^^Arizona",,,,,1967,,,,Map,,,screwworm_00250,,,,,,,,,,,,,,,,,,,,,,,,,,,,,,,,,,,,,,,13,9,"O.H. Graham Collection",,,,,https://www.nal.usda.gov/exhibits/speccoll/files/original/f9dbea07fa7e3508961f217511a65f31.jpg,Text,"Screwworm Eradication Records",1,0
7251,https://www.nal.usda.gov/exhibits/speccoll/items/show/7251,"Confirmed Screwworm Cases:  1970","Texas^^New Mexico^^Arizona^^California",,,,,1970,,,,Map,,,screwworm_00252,,,,,,,,,,,,,,,,,,,,,,,,,,,,,,,,,,,,,,,13,9,"O.H. Graham Collection",,,,,https://www.nal.usda.gov/exhibits/speccoll/files/original/2cb159b4d7e9742d2201924dd83dc447.jpg,Text,"Screwworm Eradication Records",1,0
7253,https://www.nal.usda.gov/exhibits/speccoll/items/show/7253,"Confirmed Screwworm Cases:  1972","case report^^Texas^^New Mexico^^Arizona",,,,,1972,,,,Map,,,screwworm_00254,,,,,,,,,,,,,,,,,,,,,,,,,,,,,,,,,,,,,,,13,9,"O.H. Graham Collection",,,,,https://www.nal.usda.gov/exhibits/speccoll/files/original/948f2090269da9c937eeb623883b7ea3.jpg,Text,"Screwworm Eradication Records",1,0
7255,https://www.nal.usda.gov/exhibits/speccoll/items/show/7255,"Confirmed Screwworm Cases:  1974","Texas^^New Mexico^^Arizona^^California",,,,,1974,,,,Map,,,screwworm_00256,,,,,,,,,,,,,,,,,,,,,,,,,,,,,,,,,,,,,,,13,9,"O.H. Graham Collection",,,,,https://www.nal.usda.gov/exhibits/speccoll/files/original/1dff755691183b2dc96862e77796b1c9.jpg,Text,"Screwworm Eradication Records",1,0
7257,https://www.nal.usda.gov/exhibits/speccoll/items/show/7257,"Confirmed Screwworm Cases:  1976","Texas^^Arizona^^New Mexico^^Oklahoma",,,,,1976,,,,Map,,,screwworm_00258,,,,,,,,,,,,,,,,,,,,,,,,,,,,,,,,,,,,,,,13,9,"O.H. Graham Collection",,,,,https://www.nal.usda.gov/exhibits/speccoll/files/original/39029e6b2d915203afbbf0a065e2f042.jpg,Text,"Screwworm Eradication Records",1,0
7259,https://www.nal.usda.gov/exhibits/speccoll/items/show/7259,"Confirmed Screwworm Cases:  1977","Texas^^Arizona^^California^^New Mexico",,,,,1977,,,,Map,,,screwworm_00259,,,,,,,,,,,,,,,,,,,,,,,,,,,,,,,,,,,,,,,13,9,"O.H. Graham Collection",,,,,https://www.nal.usda.gov/exhibits/speccoll/files/original/d5dffd536f3ec4f567cec0462efab528.jpg,Text,"Screwworm Eradication Records",1,0
7261,https://www.nal.usda.gov/exhibits/speccoll/items/show/7261,"Confirmed Screwworm Cases:  1979","Texas^^California^^New Mexico^^Arizona",,,,,1979,,,,Map,,,screwworm_00261,,,,,,,,,,,,,,,,,,,,,,,,,,,,,,,,,,,,,,,13,9,"O.H. Graham Collection",,,,,https://www.nal.usda.gov/exhibits/speccoll/files/original/01eb13a0d5f5ef715393169d5c61d9d3.jpg,Text,"Screwworm Eradication Records",1,0
7265,https://www.nal.usda.gov/exhibits/speccoll/items/show/7265,"Screwworm Larvae Collection",livestock^^Texas,,Mitchell,,,1980-04-28,,,,"Case report copy",,,screwworm_1356,,,,,,,,,,,,,,,,,,,,,,,,,,,,,,,,,,,,,,,13,10,"Screwworm Eradication Records",,,,,https://www.nal.usda.gov/exhibits/speccoll/files/original/7181be70e274d79e85bbbfd0c27b9382.jpg,Text,"Screwworm Eradication Records",1,0
7340,https://www.nal.usda.gov/exhibits/speccoll/items/show/7340,"Field Tests of Larvicides and Wound Protectors of Natural Screwworm Cases, Menard, Texas, 1938:  A Special Report","wound treatment^^insecticide^^Texas^^experiment","Excerpts, pages title, 1-13 and 34-36","Knipling^^Bureau of Entomology and Plant Quarantine",,,1939-01-18,,,,"Report copy^^17 pages",,,screwworm_00147,,,,,,,,,,,,,,,,,,,,,,,,,,,,,,,,,,,,,,,,2,"Southeastern Eradication Records",,,,,"https://www.nal.usda.gov/exhibits/speccoll/files/original/8fc8f11dba96f89baea347c52816dbc0.jpg,https://www.nal.usda.gov/exhibits/speccoll/files/original/a49cb1b9630916ee8208854ef2b4ec0c.jpg,https://www.nal.usda.gov/exhibits/speccoll/files/original/fd2830c58deda5e7dae56ec49f298667.jpg,https://www.nal.usda.gov/exhibits/speccoll/files/original/01a2bca78a7293a112ec56b5683d0f79.jpg,https://www.nal.usda.gov/exhibits/speccoll/files/original/4c49fb2e18f242cb979c3172100cd98b.jpg,https://www.nal.usda.gov/exhibits/speccoll/files/original/b0750d506b369ecc4558a456715d1cfb.jpg,https://www.nal.usda.gov/exhibits/speccoll/files/original/344ad2edea65f9f1aec6aed8e0b3f29a.jpg,https://www.nal.usda.gov/exhibits/speccoll/files/original/66ca83d64520705ae4b985b056bf29fa.jpg,https://www.nal.usda.gov/exhibits/speccoll/files/original/919ee393d846d7ee8df733ca79d5acac.jpg,https://www.nal.usda.gov/exhibits/speccoll/files/original/5966eb5b53ce8e3c8b577a50fbf02e7f.jpg,https://www.nal.usda.gov/exhibits/speccoll/files/original/0821b1a6f61de241447277a767822fde.jpg,https://www.nal.usda.gov/exhibits/speccoll/files/original/d30ae4339fa9d122670c7a822a72ba19.jpg,https://www.nal.usda.gov/exhibits/speccoll/files/original/00860378d3601878ce3b2ba11d03d2ab.jpg,https://www.nal.usda.gov/exhibits/speccoll/files/original/e67df44fc3aa272daf2393c7741e35d5.jpg,https://www.nal.usda.gov/exhibits/speccoll/files/original/1bccd9d9fc434bdcfd050c5e92c5775e.jpg,https://www.nal.usda.gov/exhibits/speccoll/files/original/fece938080e598b9ec5be349d3acffaa.jpg,https://www.nal.usda.gov/exhibits/speccoll/files/original/1df157c3f3232b32b6f615c8ea078b02.jpg",Text,"Screwworm Eradication Records",1,0
7351,https://www.nal.usda.gov/exhibits/speccoll/items/show/7351,"Screwworm Stronghold Attacked","Texas^^New Mexico^^overwintering^^public information",,"Agricultural Research Service, United States Department of Agriculture",,,1963-01,,,,"Pamphlet^^6 pages",,,screwworm_1227,,,,,,,,,,,,,,,,,,,,,,,,,,,,,,,,,,,,,,,14,7,"Edward F. Knipling Papers",,,,,"https://www.nal.usda.gov/exhibits/speccoll/files/original/b07fd79507e2202cc85d8fcf31eaf495.jpg,https://www.nal.usda.gov/exhibits/speccoll/files/original/261786005bdf476a6c3d97116b435464.jpg,https://www.nal.usda.gov/exhibits/speccoll/files/original/ddb497b4e4fd4e7d55f834b57e900305.jpg,https://www.nal.usda.gov/exhibits/speccoll/files/original/d6ece2a0c49245b3fd89775352d756b1.jpg,https://www.nal.usda.gov/exhibits/speccoll/files/original/b3d93e74f24c1eccedee70cc8ed8b021.jpg,https://www.nal.usda.gov/exhibits/speccoll/files/original/fa2d9a30e3d6ec993f146939f906913c.jpg",Text,"Screwworm Eradication Records",1,0
